{"text_format":"1","workbook":"xlsx","n_sheets":5,"sheets":["General","Conic","Cylindric","Parameters","Ellipsoids"],"not_rendered":{"charts":0,"images":0,"macros":1,"external_links":0,"defined_names":10,"comments":0,"pivot_tables":0},"unopened":[],"bounds":{"document_bytes":16777216,"sheet_cells":100000,"rows_first":2000,"rows_last":500,"rows_between":2000,"halvings":0,"cell_chars":16384,"cell_head_chars":4096},"cells_cut":0,"cells_raw":0,"read":"whole","date_system":"1900"}

{"sheet":"General","index":0,"n_rows":0,"n_cols":0,"rows_kept":0,"cut":false,"hidden":false,"merged":[[0,0,0,7]]}

{"sheet":"Conic","index":1,"n_rows":51,"n_cols":11,"rows_kept":51,"cut":false,"hidden":false,"merged":[]}
["Lambert Conformal Conic"]
[]
[null,"State/Zone","WI Central",{"$f":"\"Code \"&VLOOKUP(C3,[0]!ConicParam,4)","v":"Code 4602"}]
[null,"Units","Survey Ft"]
[null,null,{"$f":"VLOOKUP($C$4,Units,2,FALSE)","v":3.2808333333333333},"conversion"]
[]
[null,"Direct Conversion",null,null,"Inverse Conversion",null,null,"Zone Parameters"]
[null,"Lat (f)",45.472906578,"d.ms","N",184406.69,{"$f":"$C$4","v":"Survey Ft"},"fs","Std Par S",{"$f":"VLOOKUP($C$3,[0]!ConicParam,7)","v":47.2},"d.ms"]
[null,"Long (l)",103.473342203,"d.ms","E",1706443.56,{"$f":"$C$4","v":"Survey Ft"},"fn","Std Par N",{"$f":"VLOOKUP($C$3,[0]!ConicParam,6)","v":45.5},"d.ms"]
[null,"N",{"$f":"F28+C21-C41*COS(C42)","v":616745.71122063696},{"$f":"$C$4","v":"Survey Ft"},"Lat (f)",{"$f":"I51","v":"+45°50'19.394464\""},null,"lo","Origin Long",{"$f":"VLOOKUP($C$3,[0]!ConicParam,8)","v":120.3},"d.ms"]
[null,"E",{"$f":"C22+C41*SIN(C42)","v":5870670.8376486758},{"$f":"$C$4","v":"Survey Ft"},"Long (l)",{"$f":"FormatAngle(DDtoDMS(DEGREES(F43)),6)","v":"+120°14'27.419636\""},null,"fb","Origin Lat",{"$f":"VLOOKUP($C$3,[0]!ConicParam,9)","v":45.2},"d.ms"]
[null,"Conv (g)",{"$f":"FormatAngle(DDtoDMS(DEGREES(C42)),3)","v":"+12°08'10.221\""},"Conv","Conv (g)",{"$f":"FormatAngle(DDtoDMS(DEGREES(F40)),3)","v":"+0°11'17.422\""},null,"Nb","Origin N",{"$f":"VLOOKUP($C$3,[0]!ConicParam,11)","v":0},"meters"]
[null,"Scale (k)",{"$f":"SQRT((1-F20^2*SIN(C37)^2))*(C41*SIN(F25))/(F17*COS(C37))","v":1.0000097679694364},"Scale","Scale (k)",{"$f":"SQRT(1-F20^2*SIN(I47)^2)*(F41*SIN(F25)/(F17*COS(I47)))","v":0.99999878302583245},null,"Eo","Origin E",{"$f":"VLOOKUP($C$3,[0]!ConicParam,10)","v":500000},"meters"]
[]
["Parameters"]
["Zone",{"$f":"CONCATENATE(C3,\" \",D3)","v":"WI Central Code 4602"},null,null,"Ellipsoid"]
["fs","Std Par S",{"$f":"RADIANS(DMStoDD(J8))","v":0.82612251261064951},"radians","a",{"$f":"Ellipsoids!C6*$C$5","v":20925604.474166665},{"$f":"$C$4","v":"Survey Ft"}]
["fn","Std Par N",{"$f":"RADIANS(DMStoDD(J9))","v":0.79994257383073442},"radians","b",{"$f":"Ellipsoids!C7*$C$5","v":20855444.883975454},{"$f":"$C$4","v":"Survey Ft"}]
["lo","Origin Long",{"$f":"RADIANS(DMStoDD(J10))","v":2.1031217486531668},"radians","f",{"$f":"Ellipsoids!C8","v":3.3528106811836675E-3}]
["fb","Origin Lat",{"$f":"RADIANS(DMStoDD(J11))","v":0.79121592757076287},"radians","e",{"$f":"SQRT(Ellipsoids!C9)","v":8.1819191042832778E-2}]
["Nb","Origin N",{"$f":"J12*VLOOKUP($C$4,Units,2,FALSE)","v":0},{"$f":"$C$4","v":"Survey Ft"},"e'",{"$f":"SQRT(Ellipsoids!C10)","v":8.209443815193436E-2}]
["Eo","Origin E",{"$f":"J13*VLOOKUP($C$4,Units,2,FALSE)","v":1640416.6666666667},{"$f":"$C$4","v":"Survey Ft"}]
[]
["Zone Constants"]
[null,null,"Q","W","fo",{"$f":"ASIN((LN(D27*COS(C17)/(D26*COS(C18))))/(C27-C26))","v":0.81306311184597557},"radians"]
[null,"South (Qs)",{"$f":"Q(F20,C17)","v":0.93526046104268379},{"$f":"W(F20,C17)","v":0.99818860294302847},null,{"$f":"FormatAngle(DDtoDMS(DEGREES(F25)),3)","v":"+46°35'06.305\""},"Central Parallel, CP"]
[null,"North (Qn)",{"$f":"Q(F20,C18)","v":0.89728676440133903},{"$f":"W(F20,C18)","v":0.99827624328563758},"K",{"$f":"(F17*COS(C17)*EXP(C26*SIN(F25)))/(D26*SIN(F25))","v":38583036.233706482},{"$f":"$C$4","v":"Survey Ft"}]
[null,"Grid Origin (Qb)",{"$f":"Q(F20,C20)","v":0.88485873569306794},null,"Rb",{"$f":"F27/(EXP(C28*SIN(F25)))","v":20288516.757094622},{"$f":"$C$4","v":"Survey Ft"}]
[null,"Central (Qo)",{"$f":"Q(F20,F25)","v":0.91618577159149861},{"$f":"W(F20,F25)","v":0.99823228999608504},"Ro",{"$f":"F27/(EXP(C29*SIN(F25)))","v":19832048.141571898},{"$f":"$C$4","v":"Survey Ft"}]
[null,null,null,null,"ko",{"$f":"(D29*TAN(F25)*F29)/(F17)","v":0.99991459764426982},"scale at CP"]
[null,null,null,null,"No",{"$f":"F28+C21-F29","v":456468.61552272364},{"$f":"$C$4","v":"Survey Ft"}]
[null,null,null,null,"ro",{"$f":"(F30*F17*SQRT(1-F20^2))/(1-F20^2*SIN(F25)^2)","v":20927586.192299146},{"$f":"$C$4","v":"Survey Ft"}]
[]
[]
[null,"Direct Conversion",null,null,"Inverse Conversion"]
[null,"Lat (f)",{"$f":"C8","v":45.472906578},"dec deg","N",{"$f":"F8","v":184406.69},{"$f":"$C$4","v":"Survey Ft"}]
[null,null,{"$f":"RADIANS(DMStoDD(C36))","v":0.79921082408269839},"radians","E",{"$f":"F9","v":1706443.56},{"$f":"$C$4","v":"Survey Ft"}]
[null,"Long (l)",{"$f":"C9","v":103.473342203},"dec deg","R'",{"$f":"F28-F36+C21","v":20104110.06709462},{"$f":"$C$4","v":"Survey Ft"}]
[null,null,{"$f":"RADIANS(DMStoDD(C38))","v":1.8115229099353931},"radians","E'",{"$f":"F37-C22","v":66026.893333333312},{"$f":"$C$4","v":"Survey Ft"}]
[null,"Q",{"$f":"Q(F20,C37)","v":0.89624034985819245},null,"Conv",{"$f":"ATAN(F39/F38)","v":3.2842366918745146E-3},"radians"]
[null,"R",{"$f":"F27/(EXP(C40*SIN(F25)))","v":20121471.776000798},null,"R",{"$f":"SQRT(F38^2+F39^2)","v":20104218.491164945}]
[null,"Conv",{"$f":"(C19-C39)*SIN(F25)","v":0.21181616706966142},"radians","Q",{"$f":"(LN(F27/F41))/(SIN(F25))","v":0.89742128213928773}]
[null,null,null,null,"Long",{"$f":"C19-(F40/SIN(F25))","v":2.0986004714594864},"radians"]
[null,null,null,null,"Latitude"," - iterative solution"]
[null,null,null,null,"iteration>>",0,1,2,3]
[null,null,null,null,"sin(Lat)",{"$f":"(EXP(2*F42)-1)/(EXP(2*F42)+1)","v":0.71503992690655616},{"$f":"F46+F50","v":0.71738968535706471},{"$f":"G46+G50","v":0.71738159057056639},{"$f":"H46+H50","v":0.71738159047339811}]
[null,null,null,null,"Lat; radians",{"$f":"ASIN(F46)","v":0.79668121805391734},{"$f":"ASIN(G46)","v":0.80004822013495169},{"$f":"ASIN(H46)","v":0.80003660098460916},{"$f":"ASIN(I46)","v":0.80003660084513595}]
[null,null,null,null,"f1",{"$f":"Q($F$20,F47)-$F$42","v":-4.7922214736105806E-3},{"$f":"Q($F$20,G47)-$F$42","v":1.6623798595127859E-5},{"$f":"Q($F$20,H47)-$F$42","v":1.9954415897416311E-10}]
[null,null,null,null,"f2",{"$f":"1/(1-F46^2)-$F$20^2/(1-$F$20^2*F46^2)","v":2.0394528095317352},{"$f":"1/(1-G46^2)-$F$20^2/(1-$F$20^2*G46^2)","v":2.0536426252320146},{"$f":"1/(1-H46^2)-$F$20^2/(1-$F$20^2*H46^2)","v":2.0535933238213815}]
[null,null,null,null,"(-f1/f2)",{"$f":"-F48/F49","v":2.349758450508541E-3},{"$f":"-G48/G49","v":-8.0947864983323231E-6},{"$f":"-H48/H49","v":-9.7168293575694909E-11}]
[null,null,null,null,null,null,null,"Lat; D M S",{"$f":"FormatAngle(DDtoDMS(DEGREES(I47)),6)","v":"+45°50'19.394464\""}]

{"sheet":"Cylindric","index":2,"n_rows":61,"n_cols":12,"rows_kept":61,"cut":false,"hidden":false,"merged":[]}
["Transverse Mercator Conformal Cylindric"]
[]
[null,"State/Zone","UTM 12",{"$f":"\"Code \"&VLOOKUP($C$3,[0]!CylindricParam,4)","v":"Code 12N"}]
[null,"Units","Meters"]
[null,null,{"$f":"VLOOKUP($C$4,Units,2,FALSE)","v":1},"conversion"]
[]
[null,"Direct Conversion",null,null,"Inverse Conversion",null,null,null,"Zone Parameters"]
[null,"Lat (f)",41,"d.ms","N",63690.932000000001,{"$f":"$C$4","v":"Meters"},null,"lo","Cen Mer",{"$f":"VLOOKUP($C$3,[0]!CylindricParam,6)","v":111},"d.ms"]
[null,"Long (l)",90.001999999999995,"d.ms","E",916159.33,{"$f":"$C$4","v":"Meters"},null,null,"Scale- 1:",{"$f":"VLOOKUP($C$3,[0]!CylindricParam,7)","v":2500}]
[null,"N",{"$f":"C45-C36+C21+C50*C43^2*(1+C43^2*(C52+C54*C43^2))","v":4756834.026998179},{"$f":"$C$4","v":"Meters"},"Lat (f)",{"$f":"FormatAngle(DDtoDMS(DEGREES(F54)),6)","v":"+0°34'29.992644\""},null,null,"lo","Origin Long",{"$f":"VLOOKUP($C$3,[0]!CylindricParam,8)","v":111},"d.ms"]
[null,"E",{"$f":"C22+C49*C43*(1+C43^2*(C51+C43^2*(C53+C55*C43^2)))","v":2270518.0584029164},{"$f":"$C$4","v":"Meters"},"Long (l)",{"$f":"FormatAngle(DDtoDMS(DEGREES(F55)),6)","v":"+107°15'45.233164\""},null,null,"fo","Origin Lat",{"$f":"VLOOKUP($C$3,[0]!CylindricParam,9)","v":0},"d.ms"]
[null,"Conv (g)",{"$f":"FormatAngle(DDtoDMS(DEGREES(C61)),3)","v":"+14°08'07.606\""},null,"Conv (g)",{"$f":"FormatAngle(DDtoDMS(DEGREES(F61)),3)","v":"+0°02'15.220\""},null,null,"No","Origin N",{"$f":"VLOOKUP($C$3,[0]!CylindricParam,11)","v":0},"meters"]
[null,"Scale (k)",{"$f":"C18*(1+C59*C43^2*(1+C60*C43^2))","v":1.0384442022039619},null,"Scale (k)",{"$f":"C18*(1+F59*F46^2*(1+F60*F46^2))","v":1.0017446243167261},null,null,"Eo","Origin E",{"$f":"VLOOKUP($C$3,[0]!CylindricParam,10)","v":500000},"meters"]
[]
["Parameters"]
["Zone",null,null,null,"Ellipsoid"]
["lo","Cen Mer",{"$f":"RADIANS(DMStoDD(K8))","v":1.9373154697137058},"radians","a",{"$f":"Ellipsoids!C6*$C$5","v":6378137},{"$f":"$C$4","v":"Meters"}]
["ko","Scale- 1:",{"$f":"1-1/K9","v":0.99960000000000004},null,"b",{"$f":"Ellipsoids!C7*$C$5","v":6356752.3141403468},{"$f":"$C$4","v":"Meters"}]
["lo","Origin Long",{"$f":"RADIANS(DMStoDD(K10))","v":1.9373154697137058},"radians","f",{"$f":"Ellipsoids!C8","v":3.3528106811836675E-3}]
["fo","Origin Lat",{"$f":"RADIANS(DMStoDD(K11))","v":0},"radians","e",{"$f":"SQRT(Ellipsoids!C9)","v":8.1819191042832778E-2}]
["No","Origin N",{"$f":"K12*C5","v":0},{"$f":"$C$4","v":"Meters"},"e'",{"$f":"SQRT(Ellipsoids!C10)","v":8.209443815193436E-2}]
["Eo","Origin E",{"$f":"K13*C5","v":500000},{"$f":"$C$4","v":"Meters"}]
[]
["Zone Constants"]
[null,"n",{"$f":"(F17-F18)/(F17+F18)","v":1.6792203946294538E-3}]
[null,"r",{"$f":"F17*(1-C25)*(1-C25^2)*(1+9*C25^2/4+225*C25^4/64)","v":6367449.1457710434},{"$f":"$C$4","v":"Meters"}]
[null,"u2",{"$f":"-3*C25/2+9*C25^3/16","v":-2.5188279284875624E-3},null,"v2",{"$f":"3*C25/2-27*C25^3/32","v":2.5188265967592532E-3}]
[null,"u4",{"$f":"15*C25^2/16-15*C25^4/32","v":2.6435410857718851E-6},null,"v4",{"$f":"21*C25^2/16-55*C25^4/32","v":3.7009490719671442E-6}]
[null,"u6",{"$f":"-35*C25^3/48","v":-3.4526289497049074E-9},null,"v6",{"$f":"151*C25^3/96","v":7.4478138772205851E-9}]
[null,"u8",{"$f":"315*C25^4/512","v":4.8918304243962143E-12},null,"v8",{"$f":"1097*C25^4/512","v":1.7035993573214752E-11}]
[null,"U0",{"$f":"2*(C27-2*C28+3*C29-4*C30)","v":-5.0482507762265542E-3},null,"V0",{"$f":"2*(F27-2*F28+3*F29-4*F30)","v":5.0228939478259519E-3}]
[null,"U2",{"$f":"8*(C28-4*C29+10*C30)","v":2.1259204158999589E-5},null,"V2",{"$f":"8*(F28-4*F29+10*F30)","v":2.9370625411151952E-5}]
[null,"U4",{"$f":"32*(C29-6*C30)","v":-1.1142335783204112E-7},null,"V4",{"$f":"32*(F29-6*F30)","v":2.350591333050015E-7}]
[null,"U6",{"$f":"128*C30","v":6.2615429432271543E-10},null,"V6",{"$f":"128*F30","v":2.1806071773714883E-9}]
[null,"wo",{"$f":"C20+SIN(C20)*COS(C20)*(C31+C32*COS(C20)^2+C33*COS(C20)^4+C34*COS(C20)^6)","v":0}]
[null,"So",{"$f":"C18*C35*C26","v":0},{"$f":"$C$4","v":"Meters"},"ro",{"$f":"C18*F17*SQRT(1-F20^2)/(1-F20^2*SIN(C20)^2)","v":6354209.6132146912},{"$f":"$C$4","v":"Meters"}]
[]
[null,"Direct Conversion",null,null,"Inverse Conversion"]
[null,"Lat (f)",{"$f":"DMStoDD(C8)","v":41},"dec deg","N",{"$f":"F8","v":63690.932000000001},{"$f":"$C$4","v":"Meters"}]
[null,null,{"$f":"RADIANS(C39)","v":0.71558499331767511},"radians","E",{"$f":"F9","v":916159.33},{"$f":"$C$4","v":"Meters"}]
[null,"Long (l)",{"$f":"DMStoDD(C9)","v":90.005555555555546},"dec deg","w",{"$f":"(F39-C21+C36)/(C18*C26)","v":1.0006584600639391E-2}]
[null,null,{"$f":"RADIANS(C41)","v":1.5708932895311183},"radians","ff",{"$f":"F41+(SIN(F41)*COS(F41))*(F31+F32*COS(F41)^2+F33*COS(F41)^4+F34*COS(F41)^6)","v":1.0057139482647493E-2}]
[null,"L",{"$f":"(C42-C17)*COS(C40)","v":-0.27654232978991355},null,"tf",{"$f":"TAN(F42)","v":1.0057478576359684E-2}]
[null,"w",{"$f":"C40+SIN(C40)*COS(C40)*(C31+C32*COS(C40)^2+C33*COS(C40)^4+C34*COS(C40)^6)","v":0.7130914102596555},null,"hf2",{"$f":"F21^2*COS(F42)^2","v":6.7388151249556773E-3}]
[null,"S",{"$f":"C18*C44*C26","v":4538757.0617980668},{"$f":"$C$4","v":"Meters"},"Rf",{"$f":"(C18*F17)/SQRT(1-F20^2*SIN(F42)^2)","v":6375587.9036151608},{"$f":"$C$4","v":"Meters"}]
[null,"t",{"$f":"TAN(C40)","v":0.86928673781622667},null,"Q",{"$f":"(F40-C22)/F45","v":6.5273875333759321E-2}]
[null,"h2",{"$f":"F21^2*COS(C40)^2","v":3.8387267203179678E-3},null,"B2",{"$f":"-F43/2*(1+F44)","v":-5.062627032554487E-3}]
[null,"R",{"$f":"(C18*F17)/SQRT(1-F20^2*SIN(C40)^2)","v":6384790.7930275779},{"$f":"$C$4","v":"Meters"},"B3",{"$f":"-(1+2*F43^2+F44)/6","v":-0.1678235201459306}]
[null,"A1",{"$f":"-C48","v":-6384790.7930275779},null,"B4",{"$f":"-(5+3*F43^2+F44*(1-9*F43^2)-4*F44^2)/12","v":-0.41723787436491744}]
[null,"A2",{"$f":"C48*C46/2","v":2775106.9800550109},null,"B5",{"$f":"(5+28*F43^2+24*F43^4+F44*(6+8*F43^2))/120","v":4.2027257250236941E-2}]
[null,"A3",{"$f":"(1-C46^2+C47)/6","v":4.1363215696190121E-2},null,"B6",{"$f":"(61+90*F43^2+45*F43^4+F44*(46-252*F43^2-90*F43^4))/360","v":0.17033032759117706}]
[null,"A4",{"$f":"(5-C46^2+C47*(9+4*C47))/12","v":0.35657900426925154},null,"B7",{"$f":"-(61+662*F43^2+1320*F43^4+720*F43^6)/5040","v":-1.2116463632999314E-2}]
[null,"A5",{"$f":"(5-18*C46^2+C46^4+C47*(14-58*C46^2))/120","v":-6.7877925807506359E-2},null,"L",{"$f":"F46*(1+F46^2*(F48+F46^2*(F50+F52*F46^2)))","v":6.5227251502590289E-2}]
[null,"A6",{"$f":"(61-58*C46^2+C46^4+C47*(270-330*C46^2))/360","v":4.9505489407691637E-2},null,"Lat (f)",{"$f":"F42+F47*F46^2*(1+F46^2*(F49+F51*F46^2))","v":1.0035607534026462E-2},"radians"]
[null,"A7",{"$f":"(61-479*C46^2+179*C46^4-C46^6)/5040","v":-3.9519756918063247E-2},null,"Long (l)",{"$f":"C19-(F53/COS(F42))","v":1.8720849193325171},"radians"]
[null,"C1",{"$f":"-C46","v":-0.86928673781622667},null,"D1",{"$f":"F43","v":1.0057478576359684E-2}]
[null,"C3",{"$f":"(1+3*C47+2*C47^2)/3","v":0.33718188393554022},null,"D3",{"$f":"-(1+F43^2-F44-2*F44^2)/3","v":-0.33109050483059382}]
[null,"C5",{"$f":"(2-C46^2)/15","v":8.295603783045484E-2},null,"D5",{"$f":"(2+5*F43^2+3*F43^4)/15","v":0.13336705300481883}]
[null,"F2",{"$f":"(1+C47)/2","v":0.50191936336015897},null,"G2",{"$f":"(1+F44)/2","v":0.50336940756247783}]
[null,"F4",{"$f":"(5-4*C46^2+C47*(9-24*C46^2))/12","v":0.16185769408218512},null,"G4",{"$f":"(1+5*F44)/12","v":8.6141172968731528E-2}]
{"$rows_left_out":2}
{"sheet":"Parameters","index":3,"n_rows":85,"n_cols":24,"rows_kept":85,"cut":false,"hidden":false,"merged":[]}
[null,"Lambert Conic",null,null,null,null,null,null,null,null,null,null,null,null,"Oblique Mercator Cylindric"]
[null,null,"NSP, SSP","North & South Std Parallel",null,null,null,null,null,null,null,null,null,null,null,"k","Scale at CM",null,"AzAxis","Axis Azimuth"]
[null,null,"LgO, Ltb","Grid origin Long & Lat",null,null,null,null,null,null,null,null,null,null,null,"LgO, LtO","Grid origin Long & Lat"]
[null,null,"Nb, EO","False Northing and Easting",null,null,null,null,null,null,null,null,null,null,null,"NO, EO","Grid origin N & E"]
[]
[null,"State","Name","Code",null,"NSP; °.'","SSP; °.'","LgO; °.'","Ltb; °.'","EO; m","Nb; m",null,null,null,"State","Name","Code","T","AzAxis","1/k","LgO; °.'","LtO; °.'","EO; m","NO; m"]
[{"$f":"CONCATENATE(B7,\" \",C7)","v":"AK 10"},"AK",10,5010,"L",51.5,53.5,176,51,1000000,0,null,null,null,"AK",1,5001,"O","tan-1(-3/4)",10000,133.4,57,5000000,-5000000]
[{"$f":"CONCATENATE(B8,\" \",C8)","v":"AR North"},"AR","North","0301","L",34.56,36.14,92,34.200000000000003,400000,0]
["AR South","AR","South","0302","L",33.18,34.46,92,32.4,400000,400000,null,null,null,"Transverse Mercator Cylindric"]
["CA 1","CA",1,"0401","L",40,41.4,122,39.200000000000003,2000000,500000,null,null,null,null,"k","Scale at CM",null,"LgCM","Long CM"]
["CA 2","CA",2,"0402","L",38.200000000000003,39.5,122,37.4,2000000,500000,null,null,null,null,"LgO, LtO","Grid origin Long & Lat"]
["CA 3","CA",3,"0403","L",37.04,38.26,120.3,36.299999999999997,2000000,500000,null,null,null,null,"NO, EO","Grid origin N & E"]
["CA 4","CA",4,"0404","L",36,37.15,119,35.200000000000003,2000000,500000]
["CA 5","CA",5,"0405","L",34.020000000000003,35.28,118,33.299999999999997,2000000,500000,null,null,null,"State","Name","Code","T","LgCM; °.'","1/k","LgO; °.'","LtO; °.'","EO; m","NO; m"]
["CA 6","CA",6,"0406","L",32.47,33.53,116.15,32.1,2000000,500000,null,null,{"$f":"CONCATENATE(O15,\" \",P15)","v":"AL East"},"AL","East","0101","T",85.5,25000,85.5,30.3,200000,0]
["CO North","CO","North","0501","L",39.43,40.47,105.3,39.200000000000003,914401.82889999996,304800.60960000003,null,null,{"$f":"CONCATENATE(O16,\" \",P16)","v":"AL West"},"AL","West","0102","T",87.3,15000,87.3,30,600000,0]
["CO Central","CO","Central","0502","L",38.270000000000003,39.450000000000003,105.3,37.5,914401.82889999996,304800.60960000003,null,null,"AZ East","AZ","East","0201","T",110.1,10000,110.1,31,213360,0]
["CO South","CO","South","0503","L",37.14,38.26,105.3,36.4,914401.82889999996,304800.60960000003,null,null,"AZ Central","AZ","Central","0202","T",111.55,10000,111.55,31,213360,0]
["CT -","CT","-","0600","L",41.12,41.52,72.45,40.5,304800.60960000003,152400.30480000001,null,null,"AZ West","AZ","West","0203","T",113.45,15000,113.45,31,213360,0]
["FL North","FL","North","0903","L",29.35,30.45,84.3,29,600000,0,null,null,"DE -","DE","-","0700","T",75.25,200000,75.25,38,200000,0]
["IA North","IA","North",1401,"L",42.04,43.16,93.3,41.3,1500000,1000000,null,null,"FL East","FL","East","0901","T",81,17000,81,24.2,200000,0]
["IA South","IA","South",1402,"L",40.369999999999997,41.47,93.3,40,500000,0,null,null,"FL West","FL","West","0902","T",82,17000,82,24.2,200000,0]
["KS North","KS","North",1501,"L",38.43,39.47,98,38.200000000000003,400000,0,null,null,"GA East","GA","East",1001,"T",82.1,10000,82.1,30,200000,0]
["KS South","KS","South",1502,"L",37.159999999999997,38.340000000000003,98.3,36.4,400000,400000,null,null,"GA West","GA","West",1002,"T",84.1,10000,84.1,30,700000,0]
["KY North","KY","North",1601,"L",37.58,38.58,84.15,37.299999999999997,500000,0,null,null,"ID East","ID","East",1101,"T",112.1,19000,112.1,41.4,200000,0]
["KY South","KY","South",1602,"L",36.44,37.56,85.45,36.200000000000003,500000,500000,null,null,"ID Central","ID","Central",1102,"T",114,19000,114,41.4,500000,0]
["LA North","LA","North",1701,"L",31.1,32.4,92.3,30.3,1000000,0,null,null,"ID West","ID","West",1103,"T",115.45,15000,115.45,41.4,800000,0]
["LA Central","LA","Central",1702,"L",29.18,30.42,91.2,28.3,1000000,0,null,null,"IL East","IL","East",1201,"T",88.2,40000,88.2,36.4,300000,0]
["LA South","LA","South",1703,"L",26.1,27.5,91.2,25.3,1000000,0,null,null,"IL West","IL","West",1202,"T",90.1,17000,90.1,36.4,700000,0]
["MD -","MD","-",1900,"L",38.18,39.270000000000003,77,37.4,400000,0,null,null,"IN East","IN","East",1301,"T",85.4,30000,85.4,37.299999999999997,100000,250000]
["MA North","MA","North",2001,"L",41.43,42.41,71.3,41,200000,750000,null,null,"IN West","IN","West",1302,"T",87.05,30000,87.05,37.299999999999997,900000,250000]
["MA South","MA","South",2002,"L",41.17,41.29,70.3,41,500000,0,null,null,"ME East","ME","East",1801,"T",68.3,10000,68.3,43.4,300000,0]
["MI North","MI","North",2111,"L",45.29,47.05,87,44.47,8000000,0,null,null,"ME West","ME","West",1802,"T",70.099999999999994,30000,70.099999999999994,42.5,900000,0]
["MI Central","MI","Central",2112,"L",44.11,45.42,84.22,43.19,6000000,0,null,null,{"$f":"CONCATENATE(O34,\" \",P34)","v":"MS East"},"MS","East",2301,"T",88.5,20000,88.5,29.3,300000,0]
["MI South","MI","South",2113,"L",42.06,43.4,84.22,41.3,4000000,0,null,null,"MS West","MS","West",2302,"T",90.2,20000,90.2,29.3,700000,0]
["MN North","MN","North",2201,"L",47.02,48.38,93.06,46.3,800000,100000,null,null,"MO East","MO","East",2401,"T",90.3,15000,90.3,35.5,250000,0]
["MN Central","MN","Central",2202,"L",45.37,47.03,94.15,45,800000,100000,null,null,"MO Central","MO","Central",2402,"T",92.3,15000,92.3,35.5,500000,0]
["MN South","MN","South",2203,"L",43.47,45.13,94,43,800000,100000,null,null,"MO West","MO","West",2403,"T",94.3,17000,94.3,36.1,850000,0]
["MT -","MT","-",2500,"L",45,49,109.3,44.15,600000,0,null,null,"NV East","NV","East",2701,"T",115.35,10000,115.35,34.450000000000003,200000,8000000]
["NC -","NC","-",3200,"L",34.200000000000003,36.1,79,33.450000000000003,609601.22,0,null,null,"NV Central","NV","Central",2702,"T",116.4,10000,116.4,34.450000000000003,500000,6000000]
["ND North","ND","North",3301,"L",47.26,48.44,100.3,47,600000,0,null,null,"NV West","NV","West",2703,"T",118.35,10000,118.35,34.450000000000003,800000,4000000]
["ND South","ND","South",3302,"L",46.11,47.29,100.3,45.4,600000,0,null,null,"NH -","NH","-",2800,"T",71.400000000000006,30000,71.400000000000006,42.3,300000,0]
["NE -","NE","-",2600,"L",40,43,100,39.5,500000,0,null,null,"NJ NY East","NJ","NY East",2900,"T",74.3,10000,74.3,38.5,150000,0]
["NY NY East","NY","NY East",3104,"L",40.4,41.02,74,40.1,300000,0,null,null,"NM East","NM","East",3001,"T",104.2,11000,104.2,31,165000,0]
["OH North","OH","North",3401,"L",40.26,41.42,82.3,39.4,600000,0,null,null,"NM Central","NM","Central",3002,"T",106.15,10000,106.15,31,500000,0]
["OH South","OH","South",3402,"L",38.44,40.020000000000003,82.3,38,600000,0,null,null,"NM West","NM","West",3003,"T",107.5,12000,107.5,31,830000,0]
["OK North","OK","North",3501,"L",35.340000000000003,36.46,98,35,600000,0,null,null,"NY East","NY","East",3101,"T",74.3,10000,74.3,38.5,150000,0]
["OK South","OK","South",3502,"L",33.56,35.14,98,33.200000000000003,600000,0,null,null,"NY Central","NY","Central",3102,"T",76.349999999999994,16000,76.349999999999994,40,250000,0]
["OR North","OR","North",3601,"L",44.2,46,120.3,43.4,2500000,0,null,null,"NY West","NY","West",3103,"T",78.349999999999994,16000,78.349999999999994,40,350000,0]
["OR South","OR","South",3602,"L",42.2,44,120.3,41.4,1500000,0,null,null,"RI -","RI","-",3800,"T",71.3,160000,71.3,41.05,100000,0]
["PA North","PA","North",3701,"L",40.53,41.57,77.45,40.1,600000,0,null,null,"VT -","VT","-",4400,"T",72.3,28000,72.3,42.3,500000,0]
["PA South","PA","South",3702,"L",39.56,40.58,77.45,39.200000000000003,600000,0,null,null,"WY East","WY","East",4901,"T",105.1,16000,105.1,40.299999999999997,200000,0]
["SC -","SC","-",3900,"L",32.299999999999997,34.5,81,31.5,609600,0,null,null,"WY East Central","WY","East Central",4902,"T",107.2,16000,107.2,40.299999999999997,400000,100000]
["SD North","SD","North",4001,"L",44.25,45.41,100,43.5,600000,0,null,null,"WY West Central","WY","West Central",4903,"T",108.45,16000,108.45,40.299999999999997,600000,0]
["SD South","SD","South",4002,"L",42.5,44.24,100.2,42.2,600000,0,null,null,"WY West","WY","West",4904,"T",110.05,16000,110.05,40.299999999999997,800000,100000]
["TN -","TN","-",4100,"L",35.15,36.25,86,34.200000000000003,600000,0,null,null,"AK 2","AK",2,5002,"T",142,10000,142,54,500000,0]
["TX North","TX","North",4201,"L",34.39,36.11,101.3,34,200000,1000000,null,null,"AK 3","AK",3,5003,"T",146,10000,146,54,500000,0]
["TX North Central","TX","North Central",4202,"L",32.08,33.58,98.3,31.4,600000,2000000,null,null,"AK 4","AK",4,5004,"T",150,10000,150,54,500000,0]
["TX Central","TX","Central",4203,"L",30.07,31.53,100.2,29.4,700000,3000000,null,null,"AK 5","AK",5,5005,"T",154,10000,154,54,500000,0]
["TX South Central","TX","South Central",4204,"L",28.23,30.17,99,27.5,600000,4000000,null,null,"AK 6","AK",6,5006,"T",158,10000,158,54,500000,0]
{"$rows_left_out":26}
{"sheet":"Ellipsoids","index":4,"n_rows":19,"n_cols":5,"rows_kept":19,"cut":false,"hidden":false,"merged":[]}
["Ellipsoid and Units"]
[]
["Ellipsoid Parameters"]
[null,"Datum","NAD 83","NAD 27"]
[null,"Ellipsoid","GRS80","Clarke 1866"]
[null,"a",6378137,6378206.4000000004,"semimajor axis, meters"]
[null,"b",{"$f":"C6-C6*C8","v":6356752.3141403468},6356358.7999999998,"semiminor axis; meters"]
[null,"f",{"$f":"1/298.25722210088","v":3.3528106811836675E-3},{"$f":"(D6-D7)/D6","v":3.4253516788043357E-3},"flattening"]
[null,"e2",{"$f":"(C6^2-C7^2)/C6^2","v":6.6943800229035668E-3},{"$f":"(D6^2-D7^2)/D6^2","v":6.8389703234850935E-3},"first eccentricity squared"]
[null,"e' 2",{"$f":"(C6^2-C7^2)/C7^2","v":6.7394967754817754E-3},{"$f":"(D6^2-D7^2)/D7^2","v":6.88606391021266E-3},"second eccentricity squared"]
[]
["Unit Conversion Constants"]
[null,"Unit","Multiply units by:"]
[null,"Meters",1,"meters"]
[null,"Int'l Ft",{"$f":"1000/(25.4*12)","v":3.2808398950131239},"int'l feet"]
[null,"Survey Ft",{"$f":"39.37/12","v":3.2808333333333333},"survey feet"]
[]
[null,"Note - Base units are meters."]
[null,null," The above conversions are multipiers"]