{"text_format":"1","workbook":"xlsx","n_sheets":8,"sheets":["Comps","Wis_SPC","Wis_UTM","WisCRS_Conic","WisCRS_Cylindric","WCCS_Conic","WCCS_Cylindric","GRS80_&_Units"],"not_rendered":{"charts":0,"images":3,"macros":1,"external_links":0,"defined_names":13,"comments":0,"pivot_tables":0},"unopened":[],"bounds":{"document_bytes":16777216,"sheet_cells":100000,"rows_first":2000,"rows_last":500,"rows_between":2000,"halvings":0,"cell_chars":16384,"cell_head_chars":4096},"cells_cut":0,"cells_raw":0,"read":"whole","date_system":"1900"}

{"sheet":"Comps","index":0,"n_rows":22,"n_cols":9,"rows_kept":22,"cut":false,"hidden":false,"merged":[]}
["Conversion Computations"]
[null,null,"Select from"]
[null,null,"dropdowns","Enter values to convert in the colored cells"]
[null,"Units","Survey Ft"]
[null,null,null,"Lat (DD.MMSSss)","Long (DD.MMSSss)",{"$f":" \"North (\"&C4&\")\"","v":"North (Survey Ft)"},{"$f":" \"East (\"&C4&\")\"","v":"East (Survey Ft)"},"Convergence","Grid Scale"]
[null,"State Plane","Central",44.15,88.46,{"$f":"Wis_SPC!C9","v":154354.5609293282},{"$f":"Wis_SPC!C10","v":2291664.9445946193},{"$f":"Wis_SPC!C11","v":"+0°52'12.760\""},{"$f":"Wis_SPC!C12","v":1}]
[null,null,null,{"$f":"Wis_SPC!F9","v":"+44°38'38.974204\""},{"$f":"Wis_SPC!F10","v":"+88°20'31.079858\""},300000,2400000,{"$f":"Wis_SPC!F11","v":"+1°10'11.530\""},{"$f":"Wis_SPC!F12","v":0.99994886269251371}]
[]
[null,"UTM / WTM","UTM 16N",44.15,88.46,{"$f":"Wis_UTM!C9","v":16079882.525738711},{"$f":"Wis_UTM!C10","v":1177670.0541070623},{"$f":"Wis_UTM!C11","v":"-1°13'58.677\""},{"$f":"Wis_UTM!C12","v":0.99984466512759351}]
[null,null,null,{"$f":"Wis_UTM!F9","v":"+13°46'16.364963\""},{"$f":"Wis_UTM!F10","v":"+89°39'03.059568\""},5000000,700000,{"$f":"Wis_UTM!F11","v":"-0°37'53.242\""},{"$f":"Wis_UTM!F12","v":1.0006164609363011}]
[]
[null,"WCCS Conic","Sawyer",45.4,90.43,{"$f":"WCCS_Conic!C9","v":311237.58245743066},{"$f":"WCCS_Conic!C10","v":813272.65383375448},{"$f":"WCCS_Conic!C11","v":"+0°17'14.104\""},{"$f":"WCCS_Conic!C12","v":1.000003311735}]
[null,"See Map",null,{"$f":"WCCS_Conic!F9","v":"+45°20'58.649597\""},{"$f":"WCCS_Conic!F10","v":"+92°48'44.722434\""},200000,275000,{"$f":"WCCS_Conic!F11","v":"-1°13'03.969\""},{"$f":"WCCS_Conic!F12","v":1.0000409025282542}]
[]
[null,"WCCS Cylindric","Polk",45.14,92.13,{"$f":"WCCS_Cylindric!C9","v":208919.2567664893},{"$f":"WCCS_Cylindric!C10","v":572350.9902556506},{"$f":"WCCS_Cylindric!C11","v":"+0°17'44.980\""},{"$f":"WCCS_Cylindric!C12","v":1.0000131574110278}]
[null,"See Map",null,{"$f":"WCCS_Cylindric!F9","v":"+44°50'26.723394\""},{"$f":"WCCS_Cylindric!F10","v":"+92°10'52.891669\""},65825.648000000001,582246.76899999997,{"$f":"WCCS_Cylindric!F11","v":"+0°19'07.349\""},{"$f":"WCCS_Cylindric!F12","v":1.0000156964067528}]
[]
[null,"WisCRS Conic","Pierce",44.35,92.11,{"$f":"WisCRS_Conic!C9","v":263007.19602946058},{"$f":"WisCRS_Conic!C10","v":561580.48306150141},{"$f":"WisCRS_Conic!C11","v":"+0°01'52.416\""},{"$f":"WisCRS_Conic!C37","v":1.0000367210009866}]
[null,"See Map",null,{"$f":"WisCRS_Conic!F9","v":"+44°10'51.897493\""},{"$f":"WisCRS_Conic!F10","v":"+93°21'53.364178\""},118430.0705,251695.2414,{"$f":"WisCRS_Conic!F11","v":"-0°47'56.006\""},{"$f":"WisCRS_Conic!G46","v":1.0000676493710769}]
[]
{"$rows_left_out":3}
{"sheet":"Wis_SPC","index":1,"n_rows":58,"n_cols":15,"rows_kept":58,"cut":false,"hidden":false,"merged":[]}
["Wis SPC -  Lambert Conic"]
[]
[null,"Units",{"$f":"Comps!C4","v":"Survey Ft"},null,{"$f":"VLOOKUP($C$3,Units,3,FALSE)","v":"survey feet"}]
[null,"Zone",{"$f":"Comps!C6","v":"Central"},null,{"$f":"HLOOKUP($C$4,ZoneInfo,2,FALSE)&\" Zone\"","v":"Central Zone"}]
[]
[null,"Direct Conversion",null,null,"Inverse Conversion"]
[null,"Lat (f)",{"$f":"Comps!D6","v":44.15},"d.ms","N",{"$f":"Comps!F7","v":300000},{"$f":"E3","v":"survey feet"}]
[null,"Long (l)",{"$f":"Comps!E6","v":88.46},"d.ms","E",{"$f":"Comps!G7","v":2400000},{"$f":"E3","v":"survey feet"}]
[null,"N",{"$f":"C41","v":154354.5609293282},{"$f":"E3","v":"survey feet"},"Lat (f)",{"$f":"H43","v":"+44°38'38.974204\""}]
[null,"E",{"$f":"C42","v":2291664.9445946193},{"$f":"E3","v":"survey feet"},"Long (l)",{"$f":"H42","v":"+88°20'31.079858\""}]
[null,"g",{"$f":"C39","v":"+0°52'12.760\""},null,"g",{"$f":"H44","v":"+1°10'11.530\""}]
[null,"k",{"$f":"C40","v":1},null,"k",{"$f":"H45","v":0.99994886269251371}]
[]
["Zone Parameters",null,null,null,null,null,null,null,null,"Wis SPC Parameters"]
[null,"Code",{"$f":"HLOOKUP($C$4,ZoneInfo,3,FALSE)","v":4802},null,null,null,null,null,null,null,"Zone","North","Central","South"]
["fs","Std Par S",{"$f":"HLOOKUP($C$4,ZoneInfo,4,FALSE)","v":44.15},{"$f":"RADIANS(DMStoDD(C16))","v":0.77230819400749073},"radians",null,"Ellipsoid",null,null,null,"Name","North","Central","South"]
["fn","Std Par N",{"$f":"HLOOKUP($C$4,[0]!ZoneInfo,5,FALSE)","v":45.3},{"$f":"RADIANS(DMStoDD(C17))","v":0.79412480965741983},"radians",null,"a",{"$f":"'GRS80_&_Units'!C5*VLOOKUP($C$3,Units,2,FALSE)","v":20925604.474166665},{"$f":"$E$3","v":"survey feet"},null,"Code",4801,4802,4803]
["lo","Origin Long",{"$f":"HLOOKUP($C$4,ZoneInfo,6,FALSE)","v":90},{"$f":"RADIANS(DMStoDD(C18))","v":1.5707963267948966},"radians",null,"b",{"$f":"'GRS80_&_Units'!C6*VLOOKUP($C$3,Units,2,FALSE)","v":20855444.883975454},{"$f":"$E$3","v":"survey feet"},"fs","Std Par S",45.34,44.15,42.44,"d.ms"]
["fb","Origin Lat",{"$f":"HLOOKUP($C$4,ZoneInfo,7,FALSE)","v":43.5},{"$f":"RADIANS(DMStoDD(C19))","v":0.76503598879084778},"radians",null,"f",{"$f":"'GRS80_&_Units'!C7","v":3.3528106811836675E-3},null,"fn","Std Par N",46.46,45.3,44.04,"d.ms"]
["Nb","Origin N",{"$f":"HLOOKUP($C$4,ZoneInfo,8,FALSE)","v":0},{"$f":"C20*VLOOKUP($C$3,Units,2,FALSE)","v":0},{"$f":"$E$3","v":"survey feet"},null,"e",{"$f":"SQRT('GRS80_&_Units'!C8)","v":8.1819191042832778E-2},null,"lo","Origin Long",{"$f":"90","v":90},90,90,"d.ms"]
{"$rows_left_out":39}
{"sheet":"Wis_UTM","index":2,"n_rows":66,"n_cols":16,"rows_kept":66,"cut":false,"hidden":false,"merged":[]}
["Transverse Mercator Cylindric"]
[]
[null,"Units",{"$f":"Comps!C4","v":"Survey Ft"},"M, F, S",{"$f":"VLOOKUP($C$3,Units,3,FALSE)","v":"survey feet"}]
[null,"Zone",{"$f":"Comps!C9","v":"UTM 16N"},"15, 16, W",{"$f":"HLOOKUP($C$4,TMZoneInfo,2,FALSE)&\" Zone\"","v":"UTM 16N Zone"}]
[]
[null,"Direct Conversion",null,null,"Inverse Conversion"]
[null,"Lat (f)",{"$f":"Comps!D9","v":44.15},"d.ms","N",{"$f":"Comps!F10","v":5000000},{"$f":"E3","v":"survey feet"}]
[null,"Long (l)",{"$f":"Comps!E9","v":88.46},"d.ms","E",{"$f":"Comps!G10","v":700000},{"$f":"E3","v":"survey feet"}]
[null,"N",{"$f":"C54","v":16079882.525738711},{"$f":"E3","v":"survey feet"},"Lat (f)",{"$f":"H56","v":"+13°46'16.364963\""}]
[null,"E",{"$f":"C55","v":1177670.0541070623},{"$f":"E3","v":"survey feet"},"Long (l)",{"$f":"H57","v":"+89°39'03.059568\""}]
[null,"g",{"$f":"C63","v":"-1°13'58.677\""},null,"g",{"$f":"H65","v":"-0°37'53.242\""}]
[null,"k",{"$f":"C64","v":0.99984466512759351},null,"k",{"$f":"H66","v":1.0006164609363011}]
[]
["Zone Parameters",null,null,null,null,null,null,null,null,null,"Wis TM Parameters"]
[null,"Code",{"$f":"HLOOKUP($C$4,TMZoneInfo,1,FALSE)","v":"UTM 16N"},null,null,null,null,null,null,null,null,"Code","UTM 15N","UTM 16N","WTM"]
[null,"Name",{"$f":"HLOOKUP($C$4,TMZoneInfo,2,FALSE)","v":"UTM 16N"},null,null,null,"Ellipsoid",null,null,null,null,"Name","UTM 15N","UTM 16N","WTM"]
["lo","Cen Mer",{"$f":"HLOOKUP($C$4,TMZoneInfo,3,FALSE)","v":87},{"$f":"RADIANS(DMStoDD(C17))","v":1.5184364492350666},"radians",null,"a",{"$f":"'GRS80_&_Units'!C5*VLOOKUP($C$3,Units,2,FALSE)","v":20925604.474166665},{"$f":"$E$3","v":"survey feet"},null,"lo","Cen Mer",93,87,90,"d.ms"]
["ko","Scale- 1:",{"$f":"HLOOKUP($C$4,TMZoneInfo,4,FALSE)","v":2500},{"$f":"1-1/C18","v":0.99960000000000004},null,null,"b",{"$f":"'GRS80_&_Units'!C6*VLOOKUP($C$3,Units,2,FALSE)","v":20855444.883975454},{"$f":"$E$3","v":"survey feet"},null,null,"Scale- 1:",2500,2500,2500]
["lo","Origin Long",{"$f":"HLOOKUP($C$4,TMZoneInfo,5,FALSE)","v":87},{"$f":"RADIANS(DMStoDD(C19))","v":1.5184364492350666},"radians",null,"f",{"$f":"'GRS80_&_Units'!C7","v":3.3528106811836675E-3},null,null,"lo","Origin Long",93,87,90,"d.ms"]
["fo","Origin Lat",{"$f":"HLOOKUP($C$4,TMZoneInfo,6,FALSE)","v":0},{"$f":"RADIANS(DMStoDD(C20))","v":0},"radians",null,"e",{"$f":"SQRT('GRS80_&_Units'!C8)","v":8.1819191042832778E-2},null,null,"fo","Origin Lat",0,0,0,"d.ms"]
{"$rows_left_out":47}
{"sheet":"WisCRS_Conic","index":3,"n_rows":46,"n_cols":17,"rows_kept":46,"cut":false,"hidden":false,"merged":[]}
["WisCRS Conic Systems"]
[]
[null,"Units",{"$f":"Comps!C4","v":"Survey Ft"}]
[null,"County",{"$f":"Comps!C18","v":"Pierce"}]
[]
[null,"Direct Conversion",null,null,"Inverse Conversion"]
[null,"Lat (f)",{"$f":"Comps!D18","v":44.35},"d.ms","N",{"$f":"Comps!F19","v":118430.0705},{"$f":"C3","v":"Survey Ft"}]
[null,"Long (l)",{"$f":"Comps!E18","v":92.11},"d.ms","E",{"$f":"Comps!G19","v":251695.2414},{"$f":"C3","v":"Survey Ft"}]
[null,"N",{"$f":"C40","v":263007.19602946058},{"$f":"C3","v":"Survey Ft"},"Lat (f)",{"$f":"FormatAngle(DDtoDMS(DEGREES(G45)),6)","v":"+44°10'51.897493\""}]
[null,"E",{"$f":"C39","v":561580.48306150141},{"$f":"C3","v":"Survey Ft"},"Long (l)",{"$f":"FormatAngle(DDtoDMS(DEGREES(-G26)),6)","v":"+93°21'53.364178\""}]
[null,"g",{"$f":"C36","v":"+0°01'52.416\""},null,"g",{"$f":"FormatAngle(DDtoDMS(DEGREES(G25)),3)","v":"-0°47'56.006\""}]
[null,"k",null,null,"k"]
[]
["County Parameters",null,"from table","for computations",null,"Zone Constants"]
[null,"County",{"$f":"VLOOKUP($C$4,WisCone,1,FALSE)","v":"Pierce"},null,null," vo",{"$f":"J17/(SQRT(1-J20^2*SIN(D17)^2))","v":20960266.61283274},null,null,null,null,"County Parameters - WisCRS Conic"]
["lO","CM Long",{"$f":"VLOOKUP($C$4,WisCRS_Cone,2,FALSE)","v":"92.1340000000"},{"$f":"RADIANS(DMStoDD(C16))*(-1)","v":-1.6096783840198814},"radians"," ro",{"$f":"(J17*(1-J20^2))/((1-J20^2*SIN(D17)^2)^1.5)","v":20888982.006303642},null,"GRS80 Ellipsoid",null,null,null,"Long (Cen Mer)","False Easting","False Northing","Lat (Cen Par)","Scale"]
["fO","CP Lat",{"$f":"VLOOKUP($C$4,WisCRS_Cone,5,FALSE)","v":"44.3810135939"},{"$f":"RADIANS(DMStoDD(C17))","v":0.7790477632257834},"radians"," ro",{"$f":"(C20*G15)/TAN(D17)","v":21228954.291041095},null,"a",{"$f":"'GRS80_&_Units'!C5*VLOOKUP(C3,Units,2,FALSE)","v":20925604.474166665},{"$f":"C3","v":"Survey Ft"},"County","(d.ms)","(Meters)","(Meters)","(d.ms)","(Cen Par)"]
["EO","False E",{"$f":"VLOOKUP($C$4,WisCRS_Cone,3,FALSE)","v":167640.33543000001},{"$f":"C18*VLOOKUP(C3,Units,2,FALSE)","v":550000.00048992503},{"$f":"C3","v":"Survey Ft"}," A0",{"$f":"1-J20^2/4-3*J20^4/64-5*J20^6/256","v":0.99832429844458415},null,"b",{"$f":"'GRS80_&_Units'!C6*VLOOKUP(C3,Units,2,FALSE)","v":20855444.883975454},{"$f":"C3","v":"Survey Ft"},"Bayfield","91.0910000000",228600.45746999999,148551.48371999999,"46.4010734158",1.0000331195000001]
["NO","False N",{"$f":"VLOOKUP($C$4,WisCRS_Cone,4,FALSE)","v":86033.087589999996},{"$f":"C19*VLOOKUP(C3,Units,2,FALSE)","v":282260.22153485834},{"$f":"C3","v":"Survey Ft"}," A2",{"$f":"(3/8)*(J20^2+J20^4/4+15*J20^6/128)","v":2.5146070728458312E-3},null,"f",{"$f":"(J17-J18)/J17","v":3.3528106811837066E-3},null,"Burnett","92.2728000000",64008.127619999999,59445.904289999999,"45.5355373517",1.0000383841]
["kO","CP Scale",{"$f":"VLOOKUP($C$4,WisCRS_Cone,6,FALSE)","v":1.0000362976999999},null,null," A4",{"$f":"(15/256)*(J20^4+3*J20^6/4)","v":2.6390466202330245E-6},null,"e",{"$f":"SQRT((J17^2-J18^2)/J17^2)","v":8.1819191042832223E-2},null,"Chippewa","91.1740000000",60045.720020000001,44091.434560000002,"44.5840284835",1.0000391126999999]
{"$rows_left_out":27}
{"sheet":"WisCRS_Cylindric","index":4,"n_rows":65,"n_cols":16,"rows_kept":65,"cut":false,"hidden":false,"merged":[]}
["WCCS Transverse Mercator Cylindric Systems"]
[]
[null,"Units",{"$f":"Comps!C4","v":"Survey Ft"}]
[null,"County",{"$f":"Comps!C21","v":"Polk"}]
[]
[null,"Direct Conversion",null,null,"Inverse Conversion"]
[null,"Lat (f)",{"$f":"Comps!D21","v":45.14},"d.ms","N",{"$f":"Comps!F22","v":120000},{"$f":"C3","v":"Survey Ft"}]
[null,"Long (l)",{"$f":"Comps!E21","v":92.13},"d.ms","E",{"$f":"Comps!G22","v":750000},{"$f":"C3","v":"Survey Ft"}]
[null,"N",{"$f":"C53","v":208919.26211938306},{"$f":"C3","v":"Survey Ft"},"Lat (f)",{"$f":"H55","v":"+44°59'05.708779\""}]
[null,"E",{"$f":"C54","v":572350.99525446212},{"$f":"C3","v":"Survey Ft"},"Long (l)",{"$f":"H56","v":"+91°31'54.973118\""}]
[null,"g",{"$f":"C62","v":"+0°17'44.980\""},null,"g",{"$f":"H64","v":"+0°46'43.134\""}]
[null,"k",{"$f":"C63","v":1.0000565428837715},null,"k",{"$f":"H65","v":1.0001361314078705}]
[]
["Zone Parameters",null,null,null,null,null,null,"GRS80 Ellipsoid"]
[null,"County",{"$f":"VLOOKUP($C$4,WisCRS_Cyl,1,FALSE)","v":"Polk"},null,null,null,null,"a",{"$f":"'GRS80_&_Units'!C5*VLOOKUP(C3,Units,2,FALSE)","v":20925604.474166665},null,"County Parameters - WisCRS Cylindric"]
[null,"lo",{"$f":"VLOOKUP($C$4,WisCRS_Cyl,2,FALSE)","v":"92.3800000000"},{"$f":"RADIANS(DMStoDD(C16))","v":1.6167566637640804},"radians",null,null,"b",{"$f":"'GRS80_&_Units'!C6*VLOOKUP(C3,Units,2,FALSE)","v":20855444.883975454},null,null,"Long (Cen Mer)","Lat (Origin)","False Easting","False Northing","Scale"]
[null,"fo",{"$f":"VLOOKUP($C$4,WisCRS_Cyl,3,FALSE)","v":"44.3940000000"},{"$f":"RADIANS(DMStoDD(C17))","v":0.77948343648791185},"radians",null,null,"f",{"$f":"(I15-I16)/I15","v":3.3528106811837066E-3},null,"County","(d.ms)","(d.ms)","(Meters)","(Meters)","(Cen Mer)"]
[null,"ko",{"$f":"VLOOKUP($C$4,WisCRS_Cyl,6,FALSE)","v":1.0000433849000001},null,null,null,null,"e",{"$f":"SQRT((I15^2-I16^2)/I15^2)","v":8.1819191042832223E-2},null,"Adams","90.0000000000","43.2200000000",147218.6942,3.7000000000000002E-3,1.0000365284999999]
[null,"No",{"$f":"VLOOKUP($C$4,WisCRS_Cyl,5,FALSE)","v":5.8999999999999999E-3},{"$f":"C19*VLOOKUP(C3,Units,2,FALSE)","v":1.9356916666666665E-2},{"$f":"C3","v":"Survey Ft"},null,null,"e'",{"$f":"SQRT((I15^2-I16^2)/I16^2)","v":8.2094438151933805E-2},null,"Ashland","90.3720000000","45.4222000000",172821.9461,1.6999999999999999E-3,1.0000495682999999]
[null,"Eo",{"$f":"VLOOKUP($C$4,WisCRS_Cyl,4,FALSE)","v":141732.28229999999},{"$f":"C20*VLOOKUP(C3,Units,2,FALSE)","v":464999.99617924995},{"$f":"C3","v":"Survey Ft"},null,null,null,null,null,"Barron","91.5100000000","45.0800000000",93150,2.8999999999999998E-3,1.0000486664999999]
{"$rows_left_out":46}
{"sheet":"WCCS_Conic","index":5,"n_rows":58,"n_cols":21,"rows_kept":58,"cut":false,"hidden":false,"merged":[[13,19,13,20]]}
["WCCS Conic Systems"]
[]
[null,"Units",{"$f":"Comps!C4","v":"Survey Ft"}]
[null,"County",{"$f":"Comps!C12","v":"Sawyer"}]
[]
[null,"Direct Conversion",null,null,"Inverse Conversion"]
[null,"Lat (f)",{"$f":"Comps!D12","v":45.4},"d.ms","N",{"$f":"Comps!F13","v":200000},{"$f":"C3","v":"Survey Ft"}]
[null,"Long (l)",{"$f":"Comps!E12","v":90.43},"d.ms","E",{"$f":"Comps!G13","v":275000},{"$f":"C3","v":"Survey Ft"}]
[null,"N",{"$f":"C41","v":311237.58245743066},{"$f":"E3","v":0},"Lat (f)",{"$f":"H43","v":"+45°20'58.649597\""}]
[null,"E",{"$f":"C42","v":813272.65383375448},{"$f":"E3","v":0},"Long (l)",{"$f":"H42","v":"+92°48'44.722434\""}]
[null,"g",{"$f":"C39","v":"+0°17'14.104\""},null,"g",{"$f":"H44","v":"-1°13'03.969\""}]
[null,"k",{"$f":"C40","v":1.000003311735},null,"k",{"$f":"H45","v":1.0000409025282542}]
[]
["Zone Parameters",null,null,null,null,null,null,null,null,null,"County Parameters - Conic",null,null,null,null,null,null,null,null,"Enlarged Ellipsoid"]
[null,"County",{"$f":"VLOOKUP($C$4,WisCone,1,FALSE)","v":"Sawyer"},null,null,null,null,null,null,null,null,"Elev","Geoid Ht","Long O","Lat b","False E","False N","N Std Par","S Std Par","a","b"]
["fs","Std Par S",{"$f":"VLOOKUP($C$4,WisCone,9,FALSE)","v":45.431001000000002},{"$f":"RADIANS(DMStoDD(C16))","v":0.79795488621955346},"radians",null,"Enlarged Ellipsoid",null,null,null,"County","(m)","(m)","(d.ms)","(d.ms)","(m)","(m)","(d.ms)","(d.ms)","(m)","(m)"]
["fn","Std Par N",{"$f":"VLOOKUP($C$4,WisCone,8,FALSE)","v":46.045000000000002},{"$f":"RADIANS(DMStoDD(C17))","v":0.80425741559260933},"radians",null,"a",{"$f":"VLOOKUP($C$4,WisCone,10,FALSE)*VLOOKUP(C3,Units,2,FALSE)","v":20926908.444655836},{"$f":"C3","v":"Survey Ft"},null,"Bayfield",304.80099999999999,-30.45,91.090999999999994,45.2,228600.4572,0,46.552999999999997,46.244999999999997,{"$f":"'GRS80_&_Units'!$C$5+L17+M17","v":6378411.3509999998},{"$f":"'GRS80_&_Units'!$C$6+L17+M17","v":6357026.6651403466}]
["lo","Origin Long",{"$f":"VLOOKUP($C$4,WisCone,4,FALSE)","v":91.07},{"$f":"RADIANS(DMStoDD(C18))","v":1.5902858367754995},"radians",null,"b",{"$f":"VLOOKUP($C$4,WisCone,11,FALSE)*VLOOKUP(C3,Units,2,FALSE)","v":20856748.85446462},{"$f":"C3","v":"Survey Ft"},null,"Burnett",304.8,-26.84,92.272800000000004,45.215000000000003,64008.128019999996,0,46.05,45.424999999999997,{"$f":"'GRS80_&_Units'!$C$5+L18+M18","v":6378414.96},{"$f":"'GRS80_&_Units'!$C$6+L18+M18","v":6357030.2741403468}]
["fb","Origin Lat",{"$f":"VLOOKUP($C$4,WisCone,5,FALSE)","v":44.484999999999999},{"$f":"RADIANS(DMStoDD(C19))","v":0.78214991173401438},"radians",null,"f",{"$f":"(H17-H18)/H17","v":3.3526017651753109E-3},null,null,"Chippewa",304.8,-29.26,91.174000000000007,44.345199999999998,60045.720090000003,0,45.082999999999998,44.485000999999997,{"$f":"'GRS80_&_Units'!$C$5+L19+M19","v":6378412.54},{"$f":"'GRS80_&_Units'!$C$6+L19+M19","v":6357027.8541403469}]
["Nb","Origin N",{"$f":"VLOOKUP($C$4,WisCone,7,FALSE)","v":0},{"$f":"C20*VLOOKUP(C3,Units,2,FALSE)","v":0},{"$f":"C3","v":"Survey Ft"},null,"e",{"$f":"SQRT((H17^2-H18^2)/H17^2)","v":8.1816646177625907E-2},null,null,"Columbia",274.32100000000003,-34.99,89.233999999999995,42.273000000000003,169164.3383,0,43.353000000000002,43.200001,{"$f":"'GRS80_&_Units'!$C$5+L20+M20","v":6378376.3310000002},{"$f":"'GRS80_&_Units'!$C$6+L20+M20","v":6356991.6451403471}]
{"$rows_left_out":39}
{"sheet":"WCCS_Cylindric","index":6,"n_rows":65,"n_cols":20,"rows_kept":65,"cut":false,"hidden":false,"merged":[[13,18,13,19]]}
["WCCS Transverse Mercator Cylindric Systems"]
[]
[null,"Units",{"$f":"Comps!C4","v":"Survey Ft"},"M, F, S",{"$f":"VLOOKUP($C$3,Units,3,FALSE)","v":"survey feet"}]
[null,"County",{"$f":"Comps!C15","v":"Polk"},null,{"$f":"VLOOKUP($C$4,WisCylin,1,FALSE)&\" County\"","v":"Polk County"}]
[]
[null,"Direct Conversion",null,null,"Inverse Conversion"]
[null,"Lat (f)",{"$f":"Comps!D15","v":45.14},"d.ms","N",{"$f":"Comps!F16","v":65825.648000000001},{"$f":"E3","v":"survey feet"}]
[null,"Long (l)",{"$f":"Comps!E15","v":92.13},"d.ms","E",{"$f":"Comps!G16","v":582246.76899999997},{"$f":"E3","v":"survey feet"}]
[null,"N",{"$f":"C53","v":208919.2567664893},{"$f":"E3","v":"survey feet"},"Lat (f)",{"$f":"H55","v":"+44°50'26.723394\""}]
[null,"E",{"$f":"C54","v":572350.9902556506},{"$f":"E3","v":"survey feet"},"Long (l)",{"$f":"H56","v":"+92°10'52.891669\""}]
[null,"g",{"$f":"C62","v":"+0°17'44.980\""},null,"g",{"$f":"H64","v":"+0°19'07.349\""}]
[null,"k",{"$f":"C63","v":1.0000131574110278},null,"k",{"$f":"H65","v":1.0000156964067528}]
[]
["Zone Parameters",null,null,null,null,null,null,null,null,null,"County Parameters - Conic",null,null,null,null,null,null,null,"Enlarged Ellipsoid"]
[null,"County",{"$f":"VLOOKUP($C$4,WisCylin,1,FALSE)","v":"Polk"},null,null,null,null,null,null,null,null,"Elev","Geoid Ht","Long O","Lat O","False E","False N","Scale factor","a","b"]
["lo","Cen Mer",{"$f":"VLOOKUP($C$4,WisCylin,4,FALSE)","v":92.38},{"$f":"RADIANS(DMStoDD(C16))","v":1.6167566637640804},"radians",null,"Enlarged Ellipsoid",null,null,null," ","(m)","(m)","(d.ms)","(d.ms)","(m)","(m)",null,"(m)","(m)"]
["ko","Scale- 1:",{"$f":"IF(D17=1,\" infinity\",ABS(1/(1-D17)))","v":" infinity"},{"$f":"VLOOKUP($C$4,WisCylin,8,FALSE)","v":1},null,null,"a",{"$f":"VLOOKUP($C$4,WisCylin,9,FALSE)*VLOOKUP($C$3,Units,2,FALSE)","v":20926512.185605831},{"$f":"$E$3","v":"survey feet"},null,"Adams",274.32100000000003,-35.049999999999997,90,43.22,147218.69450000001,0,0.99999899999999997,{"$f":"'GRS80_&_Units'!$C$5+L17+M17","v":6378376.2710000006},{"$f":"'GRS80_&_Units'!$C$6+L17+M17","v":6356991.5851403475}]
["lo","Origin Long",{"$f":"VLOOKUP($C$4,WisCylin,4,FALSE)","v":92.38},{"$f":"RADIANS(DMStoDD(C18))","v":1.6167566637640804},"radians",null,"b",{"$f":"VLOOKUP($C$4,WisCylin,10,FALSE)*VLOOKUP($C$3,Units,2,FALSE)","v":20856352.59541462},{"$f":"$E$3","v":"survey feet"},null,"Ashland",365.76,-30.84,90.372,45.422199999999997,172821.94560000001,0,0.99999700000000002,{"$f":"'GRS80_&_Units'!$C$5+L18+M18","v":6378471.9199999999},{"$f":"'GRS80_&_Units'!$C$6+L18+M18","v":6357087.2341403468}]
["fo","Origin Lat",{"$f":"VLOOKUP($C$4,WisCylin,5,FALSE)","v":44.393999999999998},{"$f":"RADIANS(DMStoDD(C19))","v":0.77948343648791185},"radians",null,"f",{"$f":"(H17-H18)/H17","v":3.3526652491794777E-3},null,null,"Barron",365.76100000000002,-29.83,91.51,45.08,93150,0,0.999996,{"$f":"'GRS80_&_Units'!$C$5+L19+M19","v":6378472.9309999999},{"$f":"'GRS80_&_Units'!$C$6+L19+M19","v":6357088.2451403467}]
["No","Origin N",{"$f":"VLOOKUP($C$4,WisCylin,7,FALSE)","v":0},{"$f":"C20*VLOOKUP($C$3,Units,2,FALSE)","v":0},{"$f":"$E$3","v":"survey feet"},null,"e",{"$f":"SQRT((H17^2-H18^2)/H17^2)","v":8.1817419502731886E-2},null,null,"Brown",35.799999999999997,-35.799999999999997,88,43,31600,4600,1.0000199999999999,{"$f":"'GRS80_&_Units'!$C$5+L20+M20","v":6378137},{"$f":"'GRS80_&_Units'!$C$6+L20+M20","v":6356752.3141403468}]
{"$rows_left_out":46}
{"sheet":"GRS80_&_Units","index":7,"n_rows":18,"n_cols":5,"rows_kept":18,"cut":false,"hidden":false,"merged":[]}
["Ellipsoid and Units"]
[]
["GRS 80 Ellipsoid Parameters"]
[]
[null,"a",6378137,"semimajor axis, meters","fixed"]
[null,"b",{"$f":"C5-C5*C7","v":6356752.3141403468},"semiminor axis; meters","computed"]
[null,"f",{"$f":"1/298.25722210088","v":3.3528106811836675E-3},"flattening","fixed"]
[null,"e2",{"$f":"(C5^2-C6^2)/C5^2","v":6.6943800229035668E-3},"first eccentricity squared","computed"]
[null,"e' 2",{"$f":"(C5^2-C6^2)/C6^2","v":6.7394967754817754E-3},"second eccentricity squared","computed"]
[]
["Unit Conversion Constants"]
[null,"Unit","Multiply units by:"]
[null,"Meters",1,"meters"]
[null,"Int'l Ft",{"$f":"1000/(25.4*12)","v":3.2808398950131239},"int'l feet"]
[null,"Survey Ft",{"$f":"39.37/12","v":3.2808333333333333},"survey feet"]
[]
[null,"Note - Base units are meters."]
[null,null," The above conversions are multipiers"]